{"text_format":"1","workbook":"xlsx","n_sheets":11,"sheets":["Instructions","Coversheet","Data Input","FX Bank Details Requirements","Multi Line Vouchers-Example","COVERSHEET LOOKUP","FBS use only","Name codes from UniFi","REF - Curency Codes","REF - Vendor no Lookup","VENDOR LOOKUP DATA"],"not_rendered":{"charts":0,"images":12,"macros":1,"external_links":0,"defined_names":181,"comments":1,"pivot_tables":0},"unopened":[],"bounds":{"document_bytes":16777216,"sheet_cells":100000,"rows_first":2000,"rows_last":500,"rows_between":2000,"halvings":0,"cell_chars":16384,"cell_head_chars":4096},"cells_cut":0,"cells_raw":0,"read":"whole","date_system":"1900"}

{"sheet":"Instructions","index":0,"n_rows":80,"n_cols":4,"rows_kept":80,"cut":false,"hidden":false,"merged":[[76,2,77,2],[58,2,60,2],[59,3,60,3],[62,2,63,2],[62,3,63,3],[65,2,69,2],[71,2,72,2]]}
[]
[]
[]
[]
[]
[]
[]
[null,null,"Request process"]
{"$rows_left_out":73}
{"sheet":"Coversheet","index":1,"n_rows":50,"n_cols":10,"rows_kept":50,"cut":false,"hidden":false,"merged":[[0,0,0,3],[2,0,2,3],[23,1,23,3],[8,0,8,1],[37,0,37,3],[20,0,20,3],[19,0,19,3],[9,0,10,1],[36,0,36,3]]}
["EFT PAYMENT REQUEST - FOREIGN VOUCHER SPREADSHEET UPLOAD \nPage 1. Coversheet                                                                                              Form ID - PAY4.7"]
[]
["Purpose of form : This request is used for multiple payment requests to single payment vendors where no Invoice exists and Purchase Orders are not legitimately required.\n                                        Note some approved exceptions currently exist. Do not use this form for expense reimbursements."]
[]
["How to: Ensure both this page and the Data Input page are fully completed and converted to PDF allowing the addition of UQ Digital Signatures from approvers. "]
["                      Incomplete or incorrectly completed forms are not able to be processed and will be returned for amendment. "]
[]
["Send to:   Email the completed Excel spreadsheet and the digitally signed PDF file (with x2 tabs -Coversheet and Data Input) to your Finance PST who will review and submit to expenses."]
{"$rows_left_out":43}
{"sheet":"Data Input","index":2,"n_rows":94,"n_cols":46,"rows_kept":94,"cut":false,"hidden":false,"merged":[[10,12,10,17],[0,3,0,25],[9,25,9,41],[9,11,9,23],[9,1,9,10],[3,1,3,3],[6,1,6,2],[5,1,5,2],[4,1,4,2]]}
[null,null,null,"EFT PAYMENT REQUEST FORM  (FX-International Bank Accounts)                                             Form ID - PAY4.7"]
[null,null,null,"                                Purpose - Used for creating payment request(s) to single payment vendors where no Invoice exists and Purchase Orders are not legitimately required. Not to be used for expense reimbursements."]
[]
[null,"Spreadsheet Summary  (Formulas - Do not enter)"]
[null,"Spreadsheet total: (Note mixed FX values) ",null,{"$f":"SUM(AF15:AF94)","v":0}]
[null,"Spreadsheet date:",null,{"$f":"TODAY()","v":"2023-05-16"}]
[null,"Voucher count:",null,{"$f":"COUNTIF(Y15:Y94,1)","v":0}]
[]
{"$rows_left_out":87}
{"sheet":"FX Bank Details Requirements","index":3,"n_rows":319,"n_cols":12,"rows_kept":319,"cut":false,"hidden":false,"merged":[]}
["COUNTRIES","PAYMENT","IBAN","ACCOUNT","SWIFT/BIC","ROUTING/ABA/SORT CODE","TAX ID","Bank code","Transit Code","BSB","Purpose of ","Notes ( If payment is made in local currency, additional information is required)"]
[null,"Currency",null,null,"8 or 11 characters","9 DIGITS",null,"3 DIGIT","5 DIGIT","6 DIGIT","Payment"]
["Australia","AUD",null,"ü",null,null,null,null,null,"ü"]
["Australia","USD",null,"ü","ü"]
["Brazil","BRL","ü",null,"ü","ü","ü",null,null,null,"ü","Bene Contact name at Entity, Bene Address, Telephone number and Tax ID"]
["Brazil","AUD",null,"ü","ü","ü",null,null,null,null,"ü","Bene Contact name at Entity, Bene Address, Telephone number "]
["Brazil","USD",null,"ü","ü","ü",null,null,null,null,"ü","Bene Contact name at Entity, Bene Address, Telephone number, For Credit Unions -Swift Code not needed however the Beneficiary Address is required "]
["Canada","CAD",null,"ü","ü",null,null,null,"ü",null,null,"Bene Contact name at Entity, Bene Address - Street Address/City/Province & Postal Code"]
{"$rows_left_out":312}
{"sheet":"Multi Line Vouchers-Example","index":4,"n_rows":18,"n_cols":19,"rows_kept":18,"cut":false,"hidden":false,"merged":[]}
["VOUCHER DEFINITION: A voucher is an internal accounting document created through Accounts Payable processes in order to record the financial transactions on a supplier account and generate subsequent payment."]
[]
[]
["SINGLE VOUCHER LINE, SINGLE DISTRIBUTION"]
[]
["COMPULSORY","COMPULSORY","COMPULSORY","COMPULSORY","COMPULSORY","COMPULSORY","COMPULSORY","COMPULSORY","COMPULSORY","COMPULSORY","COMPULSORY","COMPULSORY","COMPULSORY","OPTIONAL","OPTIONAL","OPTIONAL","COMPULSORY","OPTIONAL","COMPULSORY"]
["01, 02 etc","30 characters alpha/numeric.                                                                                                                                                                                                                                                                                                                                      Ensure the Invoice Number is unique by adding a date.","Vendor Number","Vendor Name","format: dd/mm/yyyy","format: 125.50","Select from list","format: 125.50",null,"\n\n(Text format)\n7 numeric characters \n","\n\n2 numeric characters","\n\n3 numeric characters","\n\n2 numeric characters","if used = UQ001","\n\n6 numeric characters","\n\n3 numeric characters","\n\n6 numeric characters","\n\n10 characters","Select from list"]
["Voucher Line Number","Invoice Number","Formula","Pulled from Coversheet tab or select Individually","Invoice Date","Total Invoice Amount","Invoice Currency ","Distribution Line Amount ","Distribution Line","Operational Unit","Site","Fund Code","Function","PC Business Unit","Project","Project Fund","Account","Free Form Tag","Payment Currency"]
{"$rows_left_out":11}
{"sheet":"COVERSHEET LOOKUP","index":5,"n_rows":93,"n_cols":2,"rows_kept":93,"cut":false,"hidden":true,"merged":[]}
[]
["Office of the Vice-Chancellor"]
["Select from list"]
["Chief Operating Officer"]
["Deputy Vice-Chancellor (Academic)"]
["Deputy Vice-Chancellor (Global Engagement)"]
["Deputy Vice-Chancellor (Research and Innovation)"]
["President of the Academic Board"]
{"$rows_left_out":86}
{"sheet":"FBS use only","index":6,"n_rows":82,"n_cols":42,"rows_kept":82,"cut":false,"hidden":true,"merged":[]}
["Record Type 000","Record Type 000","Record Type 000","Record Type 000","Record Type 000","Record Type 000","Record Type 000","Record Type 000","Record Type 000","Record Type 000","Record Type 000","Record Type 000","Record Type 000","Record Type 000","Record Type 000","Record Type 000","Record Type 0-0-0","Record Type 000","Record Type 000","Record Type 000","Record Type 000","Record Type 000","Record Type 000","Record Type 000","Record Type 000","Record Type 000","Record Type 000","Record Type 000","Record Type 100","Record Type 100","Record Type 100","Record Type 110","Record Type 110","Record Type 110","Record Type 110","Record Type 110","Record Type 110","Record Type 110","Record Type 110","Record Type 110","Record Type 110","Record Type 110"]
["Invoice Number","Invoice Date","Vendor ID","Gross Invoice Amount","Transaction Currency","Name 1","Email ID","Country","Address Line 1","Address Line 2","Address Line 3","Address Line 4","City","County","State","Country","External Bank ID","Bank Account #","DFI ID","Beneficiary Bank","Address Line 1","Address Line 2","Address Line 3","Address Line 4","City","County","State","International Bank Account Num","Voucher Line Number","Description","Merchandise Amt","Distribution Line","Account","Operational Unit","Merchandise Amt","PC Business Unit","Project Fund","Site","Fund Code","Function","Project","Free Form Tag"]
[{"$f":"+'Data Input'!Z15","v":0},{"$f":"+'Data Input'!AC15","v":"00:00:00"},{"$f":"IF(ISBLANK('Data Input'!AA15), \" \", 'Data Input'!AA15)","v":"VENDOR #"},{"$f":"ROUND((+'Data Input'!AD15),2)","v":0},{"$f":"+'Data Input'!AE15","v":0},{"$f":"+'Data Input'!B15","v":0},{"$f":"+'Data Input'!C15","v":0},{"$f":"+'Data Input'!D15","v":0},{"$f":"IF(+'Data Input'!E15=0, \"\",+'Data Input'!E15)","v":""},{"$f":"IF(+'Data Input'!F15=0, \"\",+'Data Input'!F15)","v":""},{"$f":"IF(+'Data Input'!G15=0, \"\",+'Data Input'!G15)","v":""},{"$f":"IF(+'Data Input'!H15=0, \"\",+'Data Input'!H15)","v":""},{"$f":"IF(+'Data Input'!I15=0, \"\",+'Data Input'!I15)","v":""},{"$f":"IF(+'Data Input'!J15=0, \"\",+'Data Input'!J15)","v":""},{"$f":"IF(+'Data Input'!K15=0, \"\",+'Data Input'!K15)","v":""},{"$f":"IF(+'Data Input'!L15=0, \"\", +'Data Input'!L15)","v":""},{"$f":"IF('Data Input'!M15=0, \" \", 'Data Input'!M15)","v":" "},{"$f":"IF('Data Input'!O15=0, \" \", 'Data Input'!O15)","v":" "},{"$f":"IF(+'Data Input'!P15=0, \" \", 'Data Input'!P15)","v":" "},{"$f":"+'Data Input'!Q15","v":0},{"$f":"+'Data Input'!R15","v":0},{"$f":"IF(+'Data Input'!S15=0, \"\",+'Data Input'!S15)","v":""},{"$f":"IF(+'Data Input'!T15=0, \"\",+'Data Input'!T15)","v":""},{"$f":"IF(+'Data Input'!U15=0, \"\",+'Data Input'!U15)","v":""},{"$f":"IF(+'Data Input'!V15=0, \"\",+'Data Input'!V15)","v":""},{"$f":"IF(+'Data Input'!W15=0, \"\",+'Data Input'!W15)","v":""},{"$f":"IF(+'Data Input'!X15=0, \"\",+'Data Input'!X15)","v":""},{"$f":"IF('Data Input'!N15=0, \" \",'Data Input'!N15)","v":" "},{"$f":"IF('Data Input'!Y15=0, \" \",'Data Input'!Y15)","v":" "},{"$f":"IF(ISBLANK('Data Input'!AB15), \" \", 'Data Input'!AB15)","v":"Select from list"},{"$f":"ROUND(IF('Data Input'!AF15=0, \" \",'Data Input'!AF15),2)","v":{"$error":"#VALUE!"}},{"$f":"IF('Data Input'!AG15=0, \" \",'Data Input'!AG15)","v":" "},{"$f":"+'Data Input'!AO15","v":0},{"$f":"+'Data Input'!AH15","v":0},{"$f":"ROUND(IF('Data Input'!AF15=0, \" \",'Data Input'!AF15),2)","v":{"$error":"#VALUE!"}},{"$f":"IF('Data Input'!AL15=0, \" \",'Data Input'!AL15)","v":" "},{"$f":"IF('Data Input'!AN15=0, \" \", 'Data Input'!AN15)","v":" "},{"$f":"+'Data Input'!AI15","v":0},{"$f":"+'Data Input'!AJ15","v":0},{"$f":"+'Data Input'!AK15","v":0},{"$f":"IF('Data Input'!AM15=0, \" \", 'Data Input'!AM15)","v":" "},{"$f":"IF('Data Input'!AP15=0, \" \", 'Data Input'!AP15)","v":" "}]
[{"$f":"+'Data Input'!Z16","v":0},{"$f":"+'Data Input'!AC16","v":"00:00:00"},{"$f":"IF(ISBLANK('Data Input'!AA16), \" \", 'Data Input'!AA16)","v":"VENDOR #"},{"$f":"ROUND((+'Data Input'!AD16),2)","v":0},{"$f":"+'Data Input'!AE16","v":0},{"$f":"+'Data Input'!B16","v":0},{"$f":"+'Data Input'!C16","v":0},{"$f":"+'Data Input'!D16","v":0},{"$f":"IF(+'Data Input'!E16=0, \"\",+'Data Input'!E16)","v":""},{"$f":"IF(+'Data Input'!F16=0, \"\",+'Data Input'!F16)","v":""},{"$f":"IF(+'Data Input'!G16=0, \"\",+'Data Input'!G16)","v":""},{"$f":"IF(+'Data Input'!H16=0, \"\",+'Data Input'!H16)","v":""},{"$f":"IF(+'Data Input'!I16=0, \"\",+'Data Input'!I16)","v":""},{"$f":"IF(+'Data Input'!J16=0, \"\",+'Data Input'!J16)","v":""},{"$f":"IF(+'Data Input'!K16=0, \"\",+'Data Input'!K16)","v":""},{"$f":"IF(+'Data Input'!L16=0, \"\", +'Data Input'!L16)","v":""},{"$f":"IF('Data Input'!M16=0, \" \", 'Data Input'!M16)","v":" "},{"$f":"IF('Data Input'!O16=0, \" \", 'Data Input'!O16)","v":" "},{"$f":"IF(+'Data Input'!P16=0, \" \", 'Data Input'!P16)","v":" "},{"$f":"+'Data Input'!Q16","v":0},{"$f":"+'Data Input'!R16","v":0},{"$f":"IF(+'Data Input'!S16=0, \"\",+'Data Input'!S16)","v":""},{"$f":"IF(+'Data Input'!T16=0, \"\",+'Data Input'!T16)","v":""},{"$f":"IF(+'Data Input'!U16=0, \"\",+'Data Input'!U16)","v":""},{"$f":"IF(+'Data Input'!V16=0, \"\",+'Data Input'!V16)","v":""},{"$f":"IF(+'Data Input'!W16=0, \"\",+'Data Input'!W16)","v":""},{"$f":"IF(+'Data Input'!X16=0, \"\",+'Data Input'!X16)","v":""},{"$f":"IF('Data Input'!N16=0, \" \",'Data Input'!N16)","v":" "},{"$f":"IF('Data Input'!Y16=0, \" \",'Data Input'!Y16)","v":" "},{"$f":"IF(ISBLANK('Data Input'!AB16), \" \", 'Data Input'!AB16)","v":"Select from list"},{"$f":"ROUND(IF('Data Input'!AF16=0, \" \",'Data Input'!AF16),2)","v":{"$error":"#VALUE!"}},{"$f":"IF('Data Input'!AG16=0, \" \",'Data Input'!AG16)","v":" "},{"$f":"+'Data Input'!AO16","v":0},{"$f":"+'Data Input'!AH16","v":0},{"$f":"ROUND(IF('Data Input'!AF16=0, \" \",'Data Input'!AF16),2)","v":{"$error":"#VALUE!"}},{"$f":"IF('Data Input'!AL16=0, \" \",'Data Input'!AL16)","v":" "},{"$f":"IF('Data Input'!AN16=0, \" \", 'Data Input'!AN16)","v":" "},{"$f":"+'Data Input'!AI16","v":0},{"$f":"+'Data Input'!AJ16","v":0},{"$f":"+'Data Input'!AK16","v":0},{"$f":"IF('Data Input'!AM16=0, \" \", 'Data Input'!AM16)","v":" "},{"$f":"IF('Data Input'!AP16=0, \" \", 'Data Input'!AP16)","v":" "}]
[{"$f":"+'Data Input'!Z17","v":0},{"$f":"+'Data Input'!AC17","v":"00:00:00"},{"$f":"IF(ISBLANK('Data Input'!AA17), \" \", 'Data Input'!AA17)","v":"VENDOR #"},{"$f":"ROUND((+'Data Input'!AD17),2)","v":0},{"$f":"+'Data Input'!AE17","v":0},{"$f":"+'Data Input'!B17","v":0},{"$f":"+'Data Input'!C17","v":0},{"$f":"+'Data Input'!D17","v":0},{"$f":"IF(+'Data Input'!E17=0, \"\",+'Data Input'!E17)","v":""},{"$f":"IF(+'Data Input'!F17=0, \"\",+'Data Input'!F17)","v":""},{"$f":"IF(+'Data Input'!G17=0, \"\",+'Data Input'!G17)","v":""},{"$f":"IF(+'Data Input'!H17=0, \"\",+'Data Input'!H17)","v":""},{"$f":"IF(+'Data Input'!I17=0, \"\",+'Data Input'!I17)","v":""},{"$f":"IF(+'Data Input'!J17=0, \"\",+'Data Input'!J17)","v":""},{"$f":"IF(+'Data Input'!K17=0, \"\",+'Data Input'!K17)","v":""},{"$f":"IF(+'Data Input'!L17=0, \"\", +'Data Input'!L17)","v":""},{"$f":"IF('Data Input'!M17=0, \" \", 'Data Input'!M17)","v":" "},{"$f":"IF('Data Input'!O17=0, \" \", 'Data Input'!O17)","v":" "},{"$f":"IF(+'Data Input'!P17=0, \" \", 'Data Input'!P17)","v":" "},{"$f":"+'Data Input'!Q17","v":0},{"$f":"+'Data Input'!R17","v":0},{"$f":"IF(+'Data Input'!S17=0, \"\",+'Data Input'!S17)","v":""},{"$f":"IF(+'Data Input'!T17=0, \"\",+'Data Input'!T17)","v":""},{"$f":"IF(+'Data Input'!U17=0, \"\",+'Data Input'!U17)","v":""},{"$f":"IF(+'Data Input'!V17=0, \"\",+'Data Input'!V17)","v":""},{"$f":"IF(+'Data Input'!W17=0, \"\",+'Data Input'!W17)","v":""},{"$f":"IF(+'Data Input'!X17=0, \"\",+'Data Input'!X17)","v":""},{"$f":"IF('Data Input'!N17=0, \" \",'Data Input'!N17)","v":" "},{"$f":"IF('Data Input'!Y17=0, \" \",'Data Input'!Y17)","v":" "},{"$f":"IF(ISBLANK('Data Input'!AB17), \" \", 'Data Input'!AB17)","v":"Select from list"},{"$f":"ROUND(IF('Data Input'!AF17=0, \" \",'Data Input'!AF17),2)","v":{"$error":"#VALUE!"}},{"$f":"IF('Data Input'!AG17=0, \" \",'Data Input'!AG17)","v":" "},{"$f":"+'Data Input'!AO17","v":0},{"$f":"+'Data Input'!AH17","v":0},{"$f":"ROUND(IF('Data Input'!AF17=0, \" \",'Data Input'!AF17),2)","v":{"$error":"#VALUE!"}},{"$f":"IF('Data Input'!AL17=0, \" \",'Data Input'!AL17)","v":" "},{"$f":"IF('Data Input'!AN17=0, \" \", 'Data Input'!AN17)","v":" "},{"$f":"+'Data Input'!AI17","v":0},{"$f":"+'Data Input'!AJ17","v":0},{"$f":"+'Data Input'!AK17","v":0},{"$f":"IF('Data Input'!AM17=0, \" \", 'Data Input'!AM17)","v":" "},{"$f":"IF('Data Input'!AP17=0, \" \", 'Data Input'!AP17)","v":" "}]
[{"$f":"+'Data Input'!Z18","v":0},{"$f":"+'Data Input'!AC18","v":"00:00:00"},{"$f":"IF(ISBLANK('Data Input'!AA18), \" \", 'Data Input'!AA18)","v":"VENDOR #"},{"$f":"ROUND((+'Data Input'!AD18),2)","v":0},{"$f":"+'Data Input'!AE18","v":0},{"$f":"+'Data Input'!B18","v":0},{"$f":"+'Data Input'!C18","v":0},{"$f":"+'Data Input'!D18","v":0},{"$f":"IF(+'Data Input'!E18=0, \"\",+'Data Input'!E18)","v":""},{"$f":"IF(+'Data Input'!F18=0, \"\",+'Data Input'!F18)","v":""},{"$f":"IF(+'Data Input'!G18=0, \"\",+'Data Input'!G18)","v":""},{"$f":"IF(+'Data Input'!H18=0, \"\",+'Data Input'!H18)","v":""},{"$f":"IF(+'Data Input'!I18=0, \"\",+'Data Input'!I18)","v":""},{"$f":"IF(+'Data Input'!J18=0, \"\",+'Data Input'!J18)","v":""},{"$f":"IF(+'Data Input'!K18=0, \"\",+'Data Input'!K18)","v":""},{"$f":"IF(+'Data Input'!L18=0, \"\", +'Data Input'!L18)","v":""},{"$f":"IF('Data Input'!M18=0, \" \", 'Data Input'!M18)","v":" "},{"$f":"IF('Data Input'!O18=0, \" \", 'Data Input'!O18)","v":" "},{"$f":"IF(+'Data Input'!P18=0, \" \", 'Data Input'!P18)","v":" "},{"$f":"+'Data Input'!Q18","v":0},{"$f":"+'Data Input'!R18","v":0},{"$f":"IF(+'Data Input'!S18=0, \"\",+'Data Input'!S18)","v":""},{"$f":"IF(+'Data Input'!T18=0, \"\",+'Data Input'!T18)","v":""},{"$f":"IF(+'Data Input'!U18=0, \"\",+'Data Input'!U18)","v":""},{"$f":"IF(+'Data Input'!V18=0, \"\",+'Data Input'!V18)","v":""},{"$f":"IF(+'Data Input'!W18=0, \"\",+'Data Input'!W18)","v":""},{"$f":"IF(+'Data Input'!X18=0, \"\",+'Data Input'!X18)","v":""},{"$f":"IF('Data Input'!N18=0, \" \",'Data Input'!N18)","v":" "},{"$f":"IF('Data Input'!Y18=0, \" \",'Data Input'!Y18)","v":" "},{"$f":"IF(ISBLANK('Data Input'!AB18), \" \", 'Data Input'!AB18)","v":"Select from list"},{"$f":"ROUND(IF('Data Input'!AF18=0, \" \",'Data Input'!AF18),2)","v":{"$error":"#VALUE!"}},{"$f":"IF('Data Input'!AG18=0, \" \",'Data Input'!AG18)","v":" "},{"$f":"+'Data Input'!AO18","v":0},{"$f":"+'Data Input'!AH18","v":0},{"$f":"ROUND(IF('Data Input'!AF18=0, \" \",'Data Input'!AF18),2)","v":{"$error":"#VALUE!"}},{"$f":"IF('Data Input'!AL18=0, \" \",'Data Input'!AL18)","v":" "},{"$f":"IF('Data Input'!AN18=0, \" \", 'Data Input'!AN18)","v":" "},{"$f":"+'Data Input'!AI18","v":0},{"$f":"+'Data Input'!AJ18","v":0},{"$f":"+'Data Input'!AK18","v":0},{"$f":"IF('Data Input'!AM18=0, \" \", 'Data Input'!AM18)","v":" "},{"$f":"IF('Data Input'!AP18=0, \" \", 'Data Input'!AP18)","v":" "}]
[{"$f":"+'Data Input'!Z19","v":0},{"$f":"+'Data Input'!AC19","v":"00:00:00"},{"$f":"IF(ISBLANK('Data Input'!AA19), \" \", 'Data Input'!AA19)","v":"VENDOR #"},{"$f":"ROUND((+'Data Input'!AD19),2)","v":0},{"$f":"+'Data Input'!AE19","v":0},{"$f":"+'Data Input'!B19","v":0},{"$f":"+'Data Input'!C19","v":0},{"$f":"+'Data Input'!D19","v":0},{"$f":"IF(+'Data Input'!E19=0, \"\",+'Data Input'!E19)","v":""},{"$f":"IF(+'Data Input'!F19=0, \"\",+'Data Input'!F19)","v":""},{"$f":"IF(+'Data Input'!G19=0, \"\",+'Data Input'!G19)","v":""},{"$f":"IF(+'Data Input'!H19=0, \"\",+'Data Input'!H19)","v":""},{"$f":"IF(+'Data Input'!I19=0, \"\",+'Data Input'!I19)","v":""},{"$f":"IF(+'Data Input'!J19=0, \"\",+'Data Input'!J19)","v":""},{"$f":"IF(+'Data Input'!K19=0, \"\",+'Data Input'!K19)","v":""},{"$f":"IF(+'Data Input'!L19=0, \"\", +'Data Input'!L19)","v":""},{"$f":"IF('Data Input'!M19=0, \" \", 'Data Input'!M19)","v":" "},{"$f":"IF('Data Input'!O19=0, \" \", 'Data Input'!O19)","v":" "},{"$f":"IF(+'Data Input'!P19=0, \" \", 'Data Input'!P19)","v":" "},{"$f":"+'Data Input'!Q19","v":0},{"$f":"+'Data Input'!R19","v":0},{"$f":"IF(+'Data Input'!S19=0, \"\",+'Data Input'!S19)","v":""},{"$f":"IF(+'Data Input'!T19=0, \"\",+'Data Input'!T19)","v":""},{"$f":"IF(+'Data Input'!U19=0, \"\",+'Data Input'!U19)","v":""},{"$f":"IF(+'Data Input'!V19=0, \"\",+'Data Input'!V19)","v":""},{"$f":"IF(+'Data Input'!W19=0, \"\",+'Data Input'!W19)","v":""},{"$f":"IF(+'Data Input'!X19=0, \"\",+'Data Input'!X19)","v":""},{"$f":"IF('Data Input'!N19=0, \" \",'Data Input'!N19)","v":" "},{"$f":"IF('Data Input'!Y19=0, \" \",'Data Input'!Y19)","v":" "},{"$f":"IF(ISBLANK('Data Input'!AB19), \" \", 'Data Input'!AB19)","v":"Select from list"},{"$f":"ROUND(IF('Data Input'!AF19=0, \" \",'Data Input'!AF19),2)","v":{"$error":"#VALUE!"}},{"$f":"IF('Data Input'!AG19=0, \" \",'Data Input'!AG19)","v":" "},{"$f":"+'Data Input'!AO19","v":0},{"$f":"+'Data Input'!AH19","v":0},{"$f":"ROUND(IF('Data Input'!AF19=0, \" \",'Data Input'!AF19),2)","v":{"$error":"#VALUE!"}},{"$f":"IF('Data Input'!AL19=0, \" \",'Data Input'!AL19)","v":" "},{"$f":"IF('Data Input'!AN19=0, \" \", 'Data Input'!AN19)","v":" "},{"$f":"+'Data Input'!AI19","v":0},{"$f":"+'Data Input'!AJ19","v":0},{"$f":"+'Data Input'!AK19","v":0},{"$f":"IF('Data Input'!AM19=0, \" \", 'Data Input'!AM19)","v":" "},{"$f":"IF('Data Input'!AP19=0, \" \", 'Data Input'!AP19)","v":" "}]
[{"$f":"+'Data Input'!Z20","v":0},{"$f":"+'Data Input'!AC20","v":"00:00:00"},{"$f":"IF(ISBLANK('Data Input'!AA20), \" \", 'Data Input'!AA20)","v":"VENDOR #"},{"$f":"ROUND((+'Data Input'!AD20),2)","v":0},{"$f":"+'Data Input'!AE20","v":0},{"$f":"+'Data Input'!B20","v":0},{"$f":"+'Data Input'!C20","v":0},{"$f":"+'Data Input'!D20","v":0},{"$f":"IF(+'Data Input'!E20=0, \"\",+'Data Input'!E20)","v":""},{"$f":"IF(+'Data Input'!F20=0, \"\",+'Data Input'!F20)","v":""},{"$f":"IF(+'Data Input'!G20=0, \"\",+'Data Input'!G20)","v":""},{"$f":"IF(+'Data Input'!H20=0, \"\",+'Data Input'!H20)","v":""},{"$f":"IF(+'Data Input'!I20=0, \"\",+'Data Input'!I20)","v":""},{"$f":"IF(+'Data Input'!J20=0, \"\",+'Data Input'!J20)","v":""},{"$f":"IF(+'Data Input'!K20=0, \"\",+'Data Input'!K20)","v":""},{"$f":"IF(+'Data Input'!L20=0, \"\", +'Data Input'!L20)","v":""},{"$f":"IF('Data Input'!M20=0, \" \", 'Data Input'!M20)","v":" "},{"$f":"IF('Data Input'!O20=0, \" \", 'Data Input'!O20)","v":" "},{"$f":"IF(+'Data Input'!P20=0, \" \", 'Data Input'!P20)","v":" "},{"$f":"+'Data Input'!Q20","v":0},{"$f":"+'Data Input'!R20","v":0},{"$f":"IF(+'Data Input'!S20=0, \"\",+'Data Input'!S20)","v":""},{"$f":"IF(+'Data Input'!T20=0, \"\",+'Data Input'!T20)","v":""},{"$f":"IF(+'Data Input'!U20=0, \"\",+'Data Input'!U20)","v":""},{"$f":"IF(+'Data Input'!V20=0, \"\",+'Data Input'!V20)","v":""},{"$f":"IF(+'Data Input'!W20=0, \"\",+'Data Input'!W20)","v":""},{"$f":"IF(+'Data Input'!X20=0, \"\",+'Data Input'!X20)","v":""},{"$f":"IF('Data Input'!N20=0, \" \",'Data Input'!N20)","v":" "},{"$f":"IF('Data Input'!Y20=0, \" \",'Data Input'!Y20)","v":" "},{"$f":"IF(ISBLANK('Data Input'!AB20), \" \", 'Data Input'!AB20)","v":"Select from list"},{"$f":"ROUND(IF('Data Input'!AF20=0, \" \",'Data Input'!AF20),2)","v":{"$error":"#VALUE!"}},{"$f":"IF('Data Input'!AG20=0, \" \",'Data Input'!AG20)","v":" "},{"$f":"+'Data Input'!AO20","v":0},{"$f":"+'Data Input'!AH20","v":0},{"$f":"ROUND(IF('Data Input'!AF20=0, \" \",'Data Input'!AF20),2)","v":{"$error":"#VALUE!"}},{"$f":"IF('Data Input'!AL20=0, \" \",'Data Input'!AL20)","v":" "},{"$f":"IF('Data Input'!AN20=0, \" \", 'Data Input'!AN20)","v":" "},{"$f":"+'Data Input'!AI20","v":0},{"$f":"+'Data Input'!AJ20","v":0},{"$f":"+'Data Input'!AK20","v":0},{"$f":"IF('Data Input'!AM20=0, \" \", 'Data Input'!AM20)","v":" "},{"$f":"IF('Data Input'!AP20=0, \" \", 'Data Input'!AP20)","v":" "}]
{"$rows_left_out":75}
{"sheet":"Name codes from UniFi","index":7,"n_rows":267,"n_cols":13,"rows_kept":267,"cut":false,"hidden":true,"merged":[]}
["Country","Description",null,"State","Description",null,"Great Britian counties",null,null,"Canada - Provinces",null,null,"Travelex Currencies"]
["ABW","Aruba",null,"AK","Alaska",null,"County","Description",null,"Province","Description",null,"AED"]
["AFG","Afghanistan",null,"AL","Alabama",null,"ABD","Aberdeenshire",null,"AB","Alberta",null,"AUD"]
["AGO","Angola",null,"AR","Arkansas",null,"ABE","Aberdeen City",null,"BC","British Columbia",null,"BHD"]
["AIA","Anguilla",null,"AS","American Samoa",null,"AGB","Argyll and Bute",null,"MB","Manitoba",null,"CAD"]
["ALA","Aland Islands",null,"AZ","Arizona",null,"AGY","Isle of Anglesey",null,"NB","New Brunswick",null,"CHF"]
["ALB","Albania",null,"CA","California",null,"ANS","Angus",null,"NF","Newfoundland",null,"CZK"]
["AND","Andorra",null,"CO","Colorado",null,"ANT","Antrim",null,"NN","Nunavut",null,"DKK"]
{"$rows_left_out":260}
{"sheet":"REF - Curency Codes","index":8,"n_rows":283,"n_cols":4,"rows_kept":283,"cut":false,"hidden":true,"merged":[[288,0,288,2],[289,0,289,2],[0,0,0,2],[283,0,283,2],[284,0,284,2],[285,0,285,2],[286,0,286,2],[287,0,287,2]]}
["ISO 4217 Currency Codes"]
["https://www.iso.org/iso-4217-currency-codes.html",null,"2020-04-29"]
[null," "]
["ENTITY","Currency","Alphabetic Code","Fund"]
["AFGHANISTAN","Afghani","AFN"]
["ÅLAND ISLANDS","Euro","EUR"]
["ALBANIA","Lek","ALL"]
["ALGERIA","Algerian Dinar","DZD"]
{"$rows_left_out":276}
{"sheet":"REF - Vendor no Lookup","index":9,"n_rows":62,"n_cols":10,"rows_kept":62,"cut":false,"hidden":true,"merged":[]}
["VENDOR #","VENDOR NAME","SELECT FROM LIST PAYMENT REQUEST TYPE","VENDOR UNIFI ACCOUNT SET UP (Single payment?)","PREVIOUSLY USED BY UQ DEPARTMENT","PURPOSE","PREVIOUS CONTACT","DO NOT MODIFY COLUMN POSITIONS - REFER KAREN PURKIS FOR ASSISTANCE","Number of vouchers 2020"]
["0000004512","Agent Commission","Agent Commission","Single Payment Supplier"]
["0000011968","AGS Survey Prizes","AGS Survey Prizes","Single Payment Supplier"]
["0000010171","Undergraduate Engineering Scholarships","AIBN RHD Milestone payments","Single Payment Supplier","AIBN","Student Scholarship","Claire Hung",null,14]
["0000001341","AR USD/CAD Loan Payments","AR USD/CAD Loan Payments","Single Payment Supplier"]
["0000001350","AusAID Expenditure Payments","AusAID Expenditure Payments","Single Payment Supplier"]
["0000029171","CARP Clinical Trial Participants","CARP Clinical Trial Participants","Single Payment Supplier","Medicine","Smoking Clinical Trial Payment","Shafees Mohammed",null,82]
["0000010066","Clinical Trial Participants Payments","Clinical Trial Participant Payments","Single Payment Supplier"]
{"$rows_left_out":55}
{"sheet":"VENDOR LOOKUP DATA","index":10,"n_rows":134,"n_cols":8,"rows_kept":134,"cut":false,"hidden":true,"merged":[]}
["SELECT FROM LIST PAYMENT REQUEST TYPE","VENDOR #","VENDOR NAME","UQ DEPARTMENT","PURPOSE","CONTACT","DO NOT MODIFY COLUMN POSITIONS - REFER KAREN PURKIS FOR ASSISTANCE","Number of vouchers 2020"]
["Select from list","VENDOR #"]
["Honorarium FX","0000010818","Honorarium FX"]
["Student Payment FX (Non USD)","0000000008","Student Payment FX (Non USD)"]
["Student Payment USD","0000012948","Student Payment USD"]
["Non Student Payment FX","0000034702","Non Student Payment FX"]
["SI-net FX","0000000009","SI-net FX"]
["UQ Press FX","0000010820","UQ Press FX"]
{"$rows_left_out":126}